Skip Menu |
 

Download (untitled) / with headers
text/plain 6.2KiB
From k.j.richardson@gre.ac.uk Fri Jul 20 10:21:54 2001
Received: from fort-point-station.mit.edu (FORT-POINT-STATION.MIT.EDU [18.72.0.53])
by rt-11.mit.edu (8.9.3/8.9.3) with ESMTP id KAA11445
for <bugs@RT-11.mit.edu>; Fri, 20 Jul 2001 10:21:53 -0400 (EDT)
Received: from alta.gre.ac.uk (alta.gre.ac.uk [193.60.48.95])
by fort-point-station.mit.edu (8.9.2/8.9.2) with ESMTP id KAA06971
for <krb5-bugs@mit.edu>; Fri, 20 Jul 2001 10:21:47 -0400 (EDT)
Received: from whack.gre.ac.uk ([193.60.51.51])
by alta.gre.ac.uk with esmtp (Exim 3.01 #1)
id 15NbA1-0006U3-00
for krb5-bugs@mit.edu; Fri, 20 Jul 2001 15:21:45 +0100
Message-Id: <Pine.GSO.3.92.1010720152045.29407A-100000@whack.gre.ac.uk>
Date: Fri, 20 Jul 2001 15:21:33 +0100 (BST)
From: <K.J.Richardson@gre.ac.uk>
To: krb5-bugs@mit.edu
Subject: Problems buidling MIT Kerberos 1.2.2

Show quoted text
>Number: 981
>Category: krb5-build
>Synopsis: Problems buidling MIT Kerberos 1.2.2
>Confidential: no
>Severity: serious
>Priority: medium
>Responsible: krb5-unassigned
>State: open
>Class: sw-bug
>Submitter-Id: unknown
>Arrival-Date: Fri Jul 20 10:22:01 EDT 2001
>Last-Modified: Fri Sep 14 13:48:55 EDT 2001
>Originator: <K.J.Richardson@gre.ac.uk>
>Organization:
>Release:
>Environment:
>Description:
I am having problems building MIT Kerberos 1.2.2 on Solaris (I have tried
on Solaris 2.6 and 8).

I used the configure options --with-cc=/usr/local/gnu/bin/gcc,
--prefix=/export/pkg/krb5, and both with and without the option
--with-ccopts=-i

The output (using gnu make with debugging on) terminates thus:


GNU Make version 3.77, by Richard Stallman and Roland McGrath.
Copyright (C) 1988, 89, 90, 91, 92, 93, 94, 95, 96, 97, 98
Free Software Foundation, Inc.
This is free software; see the source for copying conditions.
There is NO warranty; not even for MERCHANTABILITY or FITNESS FOR A
PARTICULAR PURPOSE.

Report bugs to <bug-make@gnu.org>.

Reading makefiles...
Reading makefile `Makefile'...
Updating makefiles....
Considering target file `Makefile'.
Considering target file `Makefile.in'.
Looking for an implicit rule for `Makefile.in'.
Trying pattern rule with stem `Makefile.in'.
Trying implicit dependency `Makefile.in.o'.
Trying pattern rule with stem `Makefile.in'.
Trying implicit dependency `Makefile.in.c'.
.
.
.
Lots of lines omitted

.
.
.

Looking for a rule with intermediate file `com_err.ct'.
Avoiding implicit rule recursion.
Trying pattern rule with stem `com_err.ct'.
Trying implicit dependency `com_err.ct,v'.
Trying pattern rule with stem `com_err.ct'.
Trying implicit dependency `RCS/com_err.ct,v'.
Trying pattern rule with stem `com_err.ct'.
Trying implicit dependency `RCS/com_err.ct'.
Trying pattern rule with stem `com_err.ct'.
Trying implicit dependency `s.com_err.ct'.
Trying pattern rule with stem `com_err.ct'.
Trying implicit dependency `SCCS/s.com_err.ct'.
Trying pattern rule with stem `com_err'.
Rejecting impossible implicit dependency `com_err.w'.
No implicit rule found for `com_err.c'.
Finished dependencies of target file `com_err.c'.
No need to remake target `com_err.c'.
Considering target file `com_err.c'.
File `com_err.c' was considered already.
Finished dependencies of target file `com_err.o'.
Dependency `com_err.c' is older than dependent `com_err.o'.
Dependency `com_err.c' is older than dependent `com_err.o'.
No need to remake target `com_err.o'.
Finished dependencies of target file `OBJS.ST'.
Dependency `error_message.o' is older than dependent `OBJS.ST'.
Dependency `et_name.o' is older than dependent `OBJS.ST'.
Dependency `init_et.o' is older than dependent `OBJS.ST'.
Dependency `com_err.o' is older than dependent `OBJS.ST'.
No need to remake target `OBJS.ST'.
Finished dependencies of target file `libcom_err.a'.
Must remake target `libcom_err.a'.
rm -f libcom_err.a
Child access: user 0 (real 0), group 1 (real 1)
Putting child 0x0005dd48 PID 15271 on the chain.
Live child 0x0005dd48 PID 15271
Reaping winning child 0x0005dd48 PID 15271
Child access: user 0 (real 0), group 1 (real 1)
Live child 0x0005dd48 PID 15272
building static com_err library
Reaping winning child 0x0005dd48 PID 15272
Child access: user 0 (real 0), group 1 (real 1)
Live child 0x0005dd48 PID 15273
Reaping losing child 0x0005dd48 PID 15273
make[2]: *** [libcom_err.a] Error 255
Removing child 0x0005dd48 PID 15273 from chain.
make[2]: Leaving directory `/export/pkg/kerberos/DIST/krb5-1.2.2/src/util/et'
Got a SIGCHLD; 1 unreaped children.
Live child 0x00052910 PID 15262
Reaping losing child 0x00052910 PID 15262
make[1]: *** [all-recurse] Error 1
Removing child 0x00052910 PID 15262 from chain.
make[1]: Leaving directory `/export/pkg/kerberos/DIST/krb5-1.2.2/src/util'
Got a SIGCHLD; 1 unreaped children.
Live child 0x0005de60 PID 15256
Reaping losing child 0x0005de60 PID 15256
make: *** [all-recurse] Error 1
Removing child 0x0005de60 PID 15256 from chain.



So there seems to be some problem building libcom_err.a but it's not
clear to me what the problem might be. (I have also tried using the Sun
make and cc compiler, and there are no disk space problems etc.)

Any ideas what the problem might be?


Thanks


Kevin Richardson


-------------------------------------------------------------------------------
Dr Kevin J. Richardson, | K.J.Richardson@greenwich.ac.uk
Computing Services, | tel +44 (0)20 8331 8392
University of Greenwich, | fax +44 (0)20 8331 8385
Wellington St., London SE18 6PF |
-------------------------------------------------------------------------------


Show quoted text
>How-To-Repeat:
>Fix:
>Audit-Trail:

Responsible-Changed-From-To: gnats-admin->krb5-unassigned
Responsible-Changed-By: raeburn
Responsible-Changed-When: Fri Sep 14 13:48:51 2001
Responsible-Changed-Why:
reformat/refile
Show quoted text
>Unformatted:
Likely pilot error; probably missing ar program in path.